{"text_format":"1","workbook":"xlsx","n_sheets":9,"sheets":["Menu","Cadastros Gerais","Detalhes","Colab","Lançamento","Dashboard","Compativo","Instruções","tab"],"not_rendered":{"charts":10,"images":10,"macros":1,"external_links":0,"defined_names":13,"comments":0,"pivot_tables":1},"unopened":[],"bounds":{"document_bytes":16777216,"sheet_cells":100000,"rows_first":2000,"rows_last":500,"rows_between":2000,"halvings":0,"cell_chars":16384,"cell_head_chars":4096},"cells_cut":0,"cells_raw":0,"read":"whole","date_system":"1900"}

{"sheet":"Menu","index":0,"n_rows":26,"n_cols":7,"rows_kept":26,"cut":false,"hidden":false,"merged":[[25,4,25,5],[25,6,25,14]]}
[]
[]
[]
[]
[]
[]
[]
[]
[]
[]
[]
[]
[]
[]
[]
[]
[]
[]
[]
[]
[]
[]
[]
[]
[]
[null,null,null,null,"Empresa:",null,"Empresa ABCDE"]

{"sheet":"Cadastros Gerais","index":1,"n_rows":21,"n_cols":6,"rows_kept":21,"cut":false,"hidden":false,"merged":[[9,2,9,3],[11,1,11,5]]}
[]
[]
[]
[]
[]
[]
[]
[]
[]
[null,"Empresa:",{"$f":"Menu!G26","v":"Empresa ABCDE"}]
[]
[null,"Cadastros Gerais\nInsira as informações gerais referentes aos processos seletivos."]
[]
[null,"Cargos",null,"Setores",null,"Etapas"]
[null,"Auxiliar Administrativo",null,"Administrativo",null,"Triagem Curricular"]
[null,"Recepcionista",null,"Produção",null,"Teste Prático"]
[null,"Analista Junior",null,"Almoxarifado",null,"Dinâmica de Grupo"]
[null,null,null,null,null,"Entrevista Inicial"]
[null,null,null,null,null,"Entrevista Gerente"]
[null,null,null,null,null,"Entrevista Final"]
[null,null,null,null,null,"Candidado Aprovado"]

{"sheet":"Detalhes","index":2,"n_rows":34,"n_cols":5,"rows_kept":34,"cut":false,"hidden":false,"merged":[[9,2,9,3],[13,2,13,4],[11,1,11,5],[17,2,17,4],[15,2,15,4]]}
[]
[]
[]
[]
[]
[]
[]
[]
[]
[null,"Empresa:",{"$f":"Menu!G26","v":"Empresa ABCDE"}]
[]
[null,"Detalhes da Vaga\nInsira os detalhes e informações da Vaga"]
[]
[null,"Vaga/Cargo:","Auxiliar Administrativo"]
[]
[null,"Descrição da Vaga:","Será responsável em auxiliar em todas as atividades do departamento administrativo."]
[]
[null,"Pré-Requisitos:","Conhecimento em informática, pacote office, inglês intermediário e boa escrita."]
[]
[null,"Escolaridade:","Ensino Médio","Etapa 1:","Triagem Curricular"]
[]
[null,"Data Abertura:","2021-10-15","Etapa 2:","Teste Prático"]
[]
[null,"Data Fechamento:","2021-10-25","Etapa 3:","Entrevista Gerente"]
[]
[null,"Setor:","Administrativo","Etapa 4:"]
[]
[null,"Fechada Fora do Prazo:",null,"Etapa 5:"]
[]
[null,"Valor do Salário:",2500]
[]
[null,"Benefícios:","Vale Alimentação, Vale Transporte"]
[]
[null,"Carga Horária:","44 horas semanais"]

{"sheet":"Colab","index":3,"n_rows":18,"n_cols":11,"rows_kept":18,"cut":false,"hidden":false,"merged":[[9,2,9,3],[11,1,11,3]]}
[]
[]
[]
[]
[]
[]
[]
[]
[]
[null,"Empresa:",{"$f":"Menu!G26","v":"Empresa ABCDE"}]
[]
[null,"CADASTRO DE CANDIDATOS\nInsira os dados dos candidados"]
[null,"Candidato","Telefone","E-mail","Idade","Endereço","Bairro","Cidade","Escolaridade","Experiências Relevantes","Observações"]
[null,"Fulano da Silva",8888888,null,19,null,null,"Bauru","Ensino Médio","Médio prazo ","xx"]
[null,"Ciclano Alves",9999999,null,21,null,null,"Pederneiras","Ensino Superior","nenhuma","xxx"]
[null,"João Paulo",1111111,null,22,null,null,"Jaú","Ensino Superior","conhecedor básico","xxx"]
[null,"Carlos Alberto",2222222,null,23,null,null,"Boracéia","Ensino Superior","nenhuma","xxx"]
[null,"Josias",222222222,null,27,null,null,"Marília ","Pós Graduado","Experiência na área designada ","xxxx"]

{"sheet":"Lançamento","index":4,"n_rows":63,"n_cols":34,"rows_kept":63,"cut":false,"hidden":false,"merged":[[9,2,9,5],[11,3,11,12],[12,3,12,4],[11,1,11,2],[12,5,12,6],[12,7,12,8],[12,9,12,10],[12,11,12,12]]}
[]
[]
[]
[]
[]
[]
[]
[]
[]
[null,"Vaga:",{"$f":"Detalhes!C14","v":"Auxiliar Administrativo"},null,null,null,"Setor:",{"$f":"Detalhes!C26","v":"Administrativo"}]
[]
[null,"CADASTRO DOS LANÇAMENTOS\n",null,"Etapas do Processo Seletivo\nInsira a data e o resultado de cada etapa definida."]
[null,"Nome do Candidato","Telefone",{"$f":"Detalhes!E20","v":"Triagem Curricular"},null,{"$f":"Detalhes!E22","v":"Teste Prático"},null,{"$f":"Detalhes!E24","v":"Entrevista Gerente"},null,{"$f":"Detalhes!E26","v":0},null,{"$f":"Detalhes!E28","v":0},null,"Atende o Perfil","Resultado","Aprovado",null,{"$f":"B13","v":"Nome do Candidato"},null,null,null,null,null,null,null,null,null,null,{"$f":"IF(D13<>0,5,0)","v":5},{"$f":"IF(F13<>0,5,0)","v":5},{"$f":"IF(H13<>0,5,0)","v":5},{"$f":"IF(J13<>0,5,0)","v":0},{"$f":"IF(L13<>0,5,0)","v":0},{"$f":"SUM(AC13:AG13)","v":15}]
[null,{"$f":"Colab!B14","v":"Fulano da Silva"},{"$f":"Colab!C14","v":8888888},"2021-10-16","Regular",null,"Péssimo",null,"Excelente",null,null,null,null,"Sim",{"$f":"IF(B14=0,\"\",AH14)","v":0.6},"Não",null,"Fulano da Silva",null,null,null,null,null,null,null,null,null,null,{"$f":"IFERROR(VLOOKUP(E14,tab!$C$1:$D$5,2,0),0)","v":3},{"$f":"IFERROR(VLOOKUP(G14,tab!$C$1:$D$5,2,0),0)","v":1},{"$f":"IFERROR(VLOOKUP(I14,tab!$C$1:$D$5,2,0),0)","v":5},{"$f":"IFERROR(VLOOKUP(K14,tab!$C$1:$D$5,2,0),0)","v":0},{"$f":"IFERROR(VLOOKUP(M14,tab!$C$1:$D$5,2,0),0)","v":0},{"$f":"SUM(AC14:AG14)/$AH$13","v":0.6}]
[null,{"$f":"Colab!B15","v":"Ciclano Alves"},{"$f":"Colab!C15","v":9999999},null,"Não Compareceu",null,"Péssimo",null,"Péssimo",null,null,null,null,"Não",0.13333333333333333,"Não",null,"Ciclano Alves",null,null,null,null,null,null,null,null,null,null,{"$f":"IFERROR(VLOOKUP(E15,tab!$C$1:$D$5,2,0),0)","v":0},{"$f":"IFERROR(VLOOKUP(G15,tab!$C$1:$D$5,2,0),0)","v":1},{"$f":"IFERROR(VLOOKUP(I15,tab!$C$1:$D$5,2,0),0)","v":1},{"$f":"IFERROR(VLOOKUP(K15,tab!$C$1:$D$5,2,0),0)","v":0},{"$f":"IFERROR(VLOOKUP(M15,tab!$C$1:$D$5,2,0),0)","v":0},{"$f":"SUM(AC15:AG15)/$AH$13","v":0.13333333333333333}]
[null,{"$f":"Colab!B16","v":"João Paulo"},{"$f":"Colab!C16","v":1111111},null,"Excelente",null,"Excelente",null,"Regular",null,null,null,null,"Sim",0.8666666666666667,"Sim",null,"João Paulo",null,null,null,null,null,null,null,null,null,null,{"$f":"IFERROR(VLOOKUP(E16,tab!$C$1:$D$5,2,0),0)","v":5},{"$f":"IFERROR(VLOOKUP(G16,tab!$C$1:$D$5,2,0),0)","v":5},{"$f":"IFERROR(VLOOKUP(I16,tab!$C$1:$D$5,2,0),0)","v":3},{"$f":"IFERROR(VLOOKUP(K16,tab!$C$1:$D$5,2,0),0)","v":0},{"$f":"IFERROR(VLOOKUP(M16,tab!$C$1:$D$5,2,0),0)","v":0},0.8666666666666667]
[null,{"$f":"Colab!B17","v":"Carlos Alberto"},{"$f":"Colab!C17","v":2222222},null,"Ruim",null,"Excelente",null,"Péssimo",null,null,null,null,"Sim",0.53333333333333333,"Não",null,"Carlos Alberto",null,null,null,null,null,null,null,null,null,null,{"$f":"IFERROR(VLOOKUP(E17,tab!$C$1:$D$5,2,0),0)","v":2},{"$f":"IFERROR(VLOOKUP(G17,tab!$C$1:$D$5,2,0),0)","v":5},{"$f":"IFERROR(VLOOKUP(I17,tab!$C$1:$D$5,2,0),0)","v":1},{"$f":"IFERROR(VLOOKUP(K17,tab!$C$1:$D$5,2,0),0)","v":0},{"$f":"IFERROR(VLOOKUP(M17,tab!$C$1:$D$5,2,0),0)","v":0},0.53333333333333333]
[null,{"$f":"Colab!B18","v":"Josias"},{"$f":"Colab!C18","v":222222222},null,"Péssimo",null,"Péssimo",null,"Péssimo",null,null,null,null,"Sim",0.2,"Não",null,"Josias",null,null,null,null,null,null,null,null,null,null,{"$f":"IFERROR(VLOOKUP(E18,tab!$C$1:$D$5,2,0),0)","v":1},{"$f":"IFERROR(VLOOKUP(G18,tab!$C$1:$D$5,2,0),0)","v":1},{"$f":"IFERROR(VLOOKUP(I18,tab!$C$1:$D$5,2,0),0)","v":1},{"$f":"IFERROR(VLOOKUP(K18,tab!$C$1:$D$5,2,0),0)","v":0},{"$f":"IFERROR(VLOOKUP(M18,tab!$C$1:$D$5,2,0),0)","v":0},0.2]
[null,{"$f":"Colab!B19","v":0},{"$f":"Colab!C19","v":0},null,"Não Compareceu",null,"Ruim",null,"Ruim",null,null,null,null,null,"",null,null,0,null,null,null,null,null,null,null,null,null,null,{"$f":"IFERROR(VLOOKUP(E19,tab!$C$1:$D$5,2,0),0)","v":0},{"$f":"IFERROR(VLOOKUP(G19,tab!$C$1:$D$5,2,0),0)","v":2},{"$f":"IFERROR(VLOOKUP(I19,tab!$C$1:$D$5,2,0),0)","v":2},{"$f":"IFERROR(VLOOKUP(K19,tab!$C$1:$D$5,2,0),0)","v":0},{"$f":"IFERROR(VLOOKUP(M19,tab!$C$1:$D$5,2,0),0)","v":0},{"$f":"SUM(AC19:AG19)/$AH$13","v":0.26666666666666666}]
[null,{"$f":"Colab!B20","v":0},{"$f":"Colab!C20","v":0},null,null,null,null,null,null,null,null,null,null,null,"",null,null,0,null,null,null,null,null,null,null,null,null,null,{"$f":"IFERROR(VLOOKUP(E20,tab!$C$1:$D$5,2,0),0)","v":0},{"$f":"IFERROR(VLOOKUP(G20,tab!$C$1:$D$5,2,0),0)","v":0},{"$f":"IFERROR(VLOOKUP(I20,tab!$C$1:$D$5,2,0),0)","v":0},{"$f":"IFERROR(VLOOKUP(K20,tab!$C$1:$D$5,2,0),0)","v":0},{"$f":"IFERROR(VLOOKUP(M20,tab!$C$1:$D$5,2,0),0)","v":0},0]
[null,{"$f":"Colab!B21","v":0},{"$f":"Colab!C21","v":0},null,null,null,null,null,null,null,null,null,null,null,"",null,null,0,null,null,null,null,null,null,null,null,null,null,{"$f":"IFERROR(VLOOKUP(E21,tab!$C$1:$D$5,2,0),0)","v":0},{"$f":"IFERROR(VLOOKUP(G21,tab!$C$1:$D$5,2,0),0)","v":0},{"$f":"IFERROR(VLOOKUP(I21,tab!$C$1:$D$5,2,0),0)","v":0},{"$f":"IFERROR(VLOOKUP(K21,tab!$C$1:$D$5,2,0),0)","v":0},{"$f":"IFERROR(VLOOKUP(M21,tab!$C$1:$D$5,2,0),0)","v":0},0]
[null,{"$f":"Colab!B22","v":0},{"$f":"Colab!C22","v":0},null,null,null,null,null,null,null,null,null,null,null,"",null,null,0,null,null,null,null,null,null,null,null,null,null,{"$f":"IFERROR(VLOOKUP(E22,tab!$C$1:$D$5,2,0),0)","v":0},{"$f":"IFERROR(VLOOKUP(G22,tab!$C$1:$D$5,2,0),0)","v":0},{"$f":"IFERROR(VLOOKUP(I22,tab!$C$1:$D$5,2,0),0)","v":0},{"$f":"IFERROR(VLOOKUP(K22,tab!$C$1:$D$5,2,0),0)","v":0},{"$f":"IFERROR(VLOOKUP(M22,tab!$C$1:$D$5,2,0),0)","v":0},0]
[null,{"$f":"Colab!B23","v":0},{"$f":"Colab!C23","v":0},null,null,null,null,null,null,null,null,null,null,null,"",null,null,0,null,null,null,null,null,null,null,null,null,null,{"$f":"IFERROR(VLOOKUP(E23,tab!$C$1:$D$5,2,0),0)","v":0},{"$f":"IFERROR(VLOOKUP(G23,tab!$C$1:$D$5,2,0),0)","v":0},{"$f":"IFERROR(VLOOKUP(I23,tab!$C$1:$D$5,2,0),0)","v":0},{"$f":"IFERROR(VLOOKUP(K23,tab!$C$1:$D$5,2,0),0)","v":0},{"$f":"IFERROR(VLOOKUP(M23,tab!$C$1:$D$5,2,0),0)","v":0},0]
[null,{"$f":"Colab!B24","v":0},{"$f":"Colab!C24","v":0},null,null,null,null,null,null,null,null,null,null,null,"",null,null,0,null,null,null,null,null,null,null,null,null,null,{"$f":"IFERROR(VLOOKUP(E24,tab!$C$1:$D$5,2,0),0)","v":0},{"$f":"IFERROR(VLOOKUP(G24,tab!$C$1:$D$5,2,0),0)","v":0},{"$f":"IFERROR(VLOOKUP(I24,tab!$C$1:$D$5,2,0),0)","v":0},{"$f":"IFERROR(VLOOKUP(K24,tab!$C$1:$D$5,2,0),0)","v":0},{"$f":"IFERROR(VLOOKUP(M24,tab!$C$1:$D$5,2,0),0)","v":0},0]
[null,{"$f":"Colab!B25","v":0},{"$f":"Colab!C25","v":0},null,null,null,null,null,null,null,null,null,null,null,"",null,null,0,null,null,null,null,null,null,null,null,null,null,{"$f":"IFERROR(VLOOKUP(E25,tab!$C$1:$D$5,2,0),0)","v":0},{"$f":"IFERROR(VLOOKUP(G25,tab!$C$1:$D$5,2,0),0)","v":0},{"$f":"IFERROR(VLOOKUP(I25,tab!$C$1:$D$5,2,0),0)","v":0},{"$f":"IFERROR(VLOOKUP(K25,tab!$C$1:$D$5,2,0),0)","v":0},{"$f":"IFERROR(VLOOKUP(M25,tab!$C$1:$D$5,2,0),0)","v":0},0]
[null,{"$f":"Colab!B26","v":0},{"$f":"Colab!C26","v":0},null,null,null,null,null,null,null,null,null,null,null,"",null,null,0,null,null,null,null,null,null,null,null,null,null,{"$f":"IFERROR(VLOOKUP(E26,tab!$C$1:$D$5,2,0),0)","v":0},{"$f":"IFERROR(VLOOKUP(G26,tab!$C$1:$D$5,2,0),0)","v":0},{"$f":"IFERROR(VLOOKUP(I26,tab!$C$1:$D$5,2,0),0)","v":0},{"$f":"IFERROR(VLOOKUP(K26,tab!$C$1:$D$5,2,0),0)","v":0},{"$f":"IFERROR(VLOOKUP(M26,tab!$C$1:$D$5,2,0),0)","v":0},0]
[null,{"$f":"Colab!B27","v":0},{"$f":"Colab!C27","v":0},null,null,null,null,null,null,null,null,null,null,null,"",null,null,0,null,null,null,null,null,null,null,null,null,null,{"$f":"IFERROR(VLOOKUP(E27,tab!$C$1:$D$5,2,0),0)","v":0},{"$f":"IFERROR(VLOOKUP(G27,tab!$C$1:$D$5,2,0),0)","v":0},{"$f":"IFERROR(VLOOKUP(I27,tab!$C$1:$D$5,2,0),0)","v":0},{"$f":"IFERROR(VLOOKUP(K27,tab!$C$1:$D$5,2,0),0)","v":0},{"$f":"IFERROR(VLOOKUP(M27,tab!$C$1:$D$5,2,0),0)","v":0},0]
[null,{"$f":"Colab!B28","v":0},{"$f":"Colab!C28","v":0},null,null,null,null,null,null,null,null,null,null,null,"",null,null,0,null,null,null,null,null,null,null,null,null,null,{"$f":"IFERROR(VLOOKUP(E28,tab!$C$1:$D$5,2,0),0)","v":0},{"$f":"IFERROR(VLOOKUP(G28,tab!$C$1:$D$5,2,0),0)","v":0},{"$f":"IFERROR(VLOOKUP(I28,tab!$C$1:$D$5,2,0),0)","v":0},{"$f":"IFERROR(VLOOKUP(K28,tab!$C$1:$D$5,2,0),0)","v":0},{"$f":"IFERROR(VLOOKUP(M28,tab!$C$1:$D$5,2,0),0)","v":0},0]
[null,{"$f":"Colab!B29","v":0},{"$f":"Colab!C29","v":0},null,null,null,null,null,null,null,null,null,null,null,"",null,null,0,null,null,null,null,null,null,null,null,null,null,{"$f":"IFERROR(VLOOKUP(E29,tab!$C$1:$D$5,2,0),0)","v":0},{"$f":"IFERROR(VLOOKUP(G29,tab!$C$1:$D$5,2,0),0)","v":0},{"$f":"IFERROR(VLOOKUP(I29,tab!$C$1:$D$5,2,0),0)","v":0},{"$f":"IFERROR(VLOOKUP(K29,tab!$C$1:$D$5,2,0),0)","v":0},{"$f":"IFERROR(VLOOKUP(M29,tab!$C$1:$D$5,2,0),0)","v":0},0]
[null,{"$f":"Colab!B30","v":0},{"$f":"Colab!C30","v":0},null,null,null,null,null,null,null,null,null,null,null,"",null,null,0,null,null,null,null,null,null,null,null,null,null,{"$f":"IFERROR(VLOOKUP(E30,tab!$C$1:$D$5,2,0),0)","v":0},{"$f":"IFERROR(VLOOKUP(G30,tab!$C$1:$D$5,2,0),0)","v":0},{"$f":"IFERROR(VLOOKUP(I30,tab!$C$1:$D$5,2,0),0)","v":0},{"$f":"IFERROR(VLOOKUP(K30,tab!$C$1:$D$5,2,0),0)","v":0},{"$f":"IFERROR(VLOOKUP(M30,tab!$C$1:$D$5,2,0),0)","v":0},0]
[null,{"$f":"Colab!B31","v":0},{"$f":"Colab!C31","v":0},null,null,null,null,null,null,null,null,null,null,null,"",null,null,0,null,null,null,null,null,null,null,null,null,null,{"$f":"IFERROR(VLOOKUP(E31,tab!$C$1:$D$5,2,0),0)","v":0},{"$f":"IFERROR(VLOOKUP(G31,tab!$C$1:$D$5,2,0),0)","v":0},{"$f":"IFERROR(VLOOKUP(I31,tab!$C$1:$D$5,2,0),0)","v":0},{"$f":"IFERROR(VLOOKUP(K31,tab!$C$1:$D$5,2,0),0)","v":0},{"$f":"IFERROR(VLOOKUP(M31,tab!$C$1:$D$5,2,0),0)","v":0},0]
[null,{"$f":"Colab!B32","v":0},{"$f":"Colab!C32","v":0},null,null,null,null,null,null,null,null,null,null,null,"",null,null,0,null,null,null,null,null,null,null,null,null,null,{"$f":"IFERROR(VLOOKUP(E32,tab!$C$1:$D$5,2,0),0)","v":0},{"$f":"IFERROR(VLOOKUP(G32,tab!$C$1:$D$5,2,0),0)","v":0},{"$f":"IFERROR(VLOOKUP(I32,tab!$C$1:$D$5,2,0),0)","v":0},{"$f":"IFERROR(VLOOKUP(K32,tab!$C$1:$D$5,2,0),0)","v":0},{"$f":"IFERROR(VLOOKUP(M32,tab!$C$1:$D$5,2,0),0)","v":0},0]
[null,{"$f":"Colab!B33","v":0},{"$f":"Colab!C33","v":0},null,null,null,null,null,null,null,null,null,null,null,"",null,null,0,null,null,null,null,null,null,null,null,null,null,{"$f":"IFERROR(VLOOKUP(E33,tab!$C$1:$D$5,2,0),0)","v":0},{"$f":"IFERROR(VLOOKUP(G33,tab!$C$1:$D$5,2,0),0)","v":0},{"$f":"IFERROR(VLOOKUP(I33,tab!$C$1:$D$5,2,0),0)","v":0},{"$f":"IFERROR(VLOOKUP(K33,tab!$C$1:$D$5,2,0),0)","v":0},{"$f":"IFERROR(VLOOKUP(M33,tab!$C$1:$D$5,2,0),0)","v":0},0]
[null,{"$f":"Colab!B34","v":0},{"$f":"Colab!C34","v":0},null,null,null,null,null,null,null,null,null,null,null,"",null,null,0,null,null,null,null,null,null,null,null,null,null,{"$f":"IFERROR(VLOOKUP(E34,tab!$C$1:$D$5,2,0),0)","v":0},{"$f":"IFERROR(VLOOKUP(G34,tab!$C$1:$D$5,2,0),0)","v":0},{"$f":"IFERROR(VLOOKUP(I34,tab!$C$1:$D$5,2,0),0)","v":0},{"$f":"IFERROR(VLOOKUP(K34,tab!$C$1:$D$5,2,0),0)","v":0},{"$f":"IFERROR(VLOOKUP(M34,tab!$C$1:$D$5,2,0),0)","v":0},0]
[null,{"$f":"Colab!B35","v":0},{"$f":"Colab!C35","v":0},null,null,null,null,null,null,null,null,null,null,null,"",null,null,0,null,null,null,null,null,null,null,null,null,null,{"$f":"IFERROR(VLOOKUP(E35,tab!$C$1:$D$5,2,0),0)","v":0},{"$f":"IFERROR(VLOOKUP(G35,tab!$C$1:$D$5,2,0),0)","v":0},{"$f":"IFERROR(VLOOKUP(I35,tab!$C$1:$D$5,2,0),0)","v":0},{"$f":"IFERROR(VLOOKUP(K35,tab!$C$1:$D$5,2,0),0)","v":0},{"$f":"IFERROR(VLOOKUP(M35,tab!$C$1:$D$5,2,0),0)","v":0},0]
[null,{"$f":"Colab!B36","v":0},{"$f":"Colab!C36","v":0},null,null,null,null,null,null,null,null,null,null,null,"",null,null,0,null,null,null,null,null,null,null,null,null,null,{"$f":"IFERROR(VLOOKUP(E36,tab!$C$1:$D$5,2,0),0)","v":0},{"$f":"IFERROR(VLOOKUP(G36,tab!$C$1:$D$5,2,0),0)","v":0},{"$f":"IFERROR(VLOOKUP(I36,tab!$C$1:$D$5,2,0),0)","v":0},{"$f":"IFERROR(VLOOKUP(K36,tab!$C$1:$D$5,2,0),0)","v":0},{"$f":"IFERROR(VLOOKUP(M36,tab!$C$1:$D$5,2,0),0)","v":0},0]
[null,{"$f":"Colab!B37","v":0},{"$f":"Colab!C37","v":0},null,null,null,null,null,null,null,null,null,null,null,"",null,null,0,null,null,null,null,null,null,null,null,null,null,{"$f":"IFERROR(VLOOKUP(E37,tab!$C$1:$D$5,2,0),0)","v":0},{"$f":"IFERROR(VLOOKUP(G37,tab!$C$1:$D$5,2,0),0)","v":0},{"$f":"IFERROR(VLOOKUP(I37,tab!$C$1:$D$5,2,0),0)","v":0},{"$f":"IFERROR(VLOOKUP(K37,tab!$C$1:$D$5,2,0),0)","v":0},{"$f":"IFERROR(VLOOKUP(M37,tab!$C$1:$D$5,2,0),0)","v":0},0]
[null,{"$f":"Colab!B38","v":0},{"$f":"Colab!C38","v":0},null,null,null,null,null,null,null,null,null,null,null,"",null,null,0,null,null,null,null,null,null,null,null,null,null,{"$f":"IFERROR(VLOOKUP(E38,tab!$C$1:$D$5,2,0),0)","v":0},{"$f":"IFERROR(VLOOKUP(G38,tab!$C$1:$D$5,2,0),0)","v":0},{"$f":"IFERROR(VLOOKUP(I38,tab!$C$1:$D$5,2,0),0)","v":0},{"$f":"IFERROR(VLOOKUP(K38,tab!$C$1:$D$5,2,0),0)","v":0},{"$f":"IFERROR(VLOOKUP(M38,tab!$C$1:$D$5,2,0),0)","v":0},0]
[null,{"$f":"Colab!B39","v":0},{"$f":"Colab!C39","v":0},null,null,null,null,null,null,null,null,null,null,null,"",null,null,0,null,null,null,null,null,null,null,null,null,null,{"$f":"IFERROR(VLOOKUP(E39,tab!$C$1:$D$5,2,0),0)","v":0},{"$f":"IFERROR(VLOOKUP(G39,tab!$C$1:$D$5,2,0),0)","v":0},{"$f":"IFERROR(VLOOKUP(I39,tab!$C$1:$D$5,2,0),0)","v":0},{"$f":"IFERROR(VLOOKUP(K39,tab!$C$1:$D$5,2,0),0)","v":0},{"$f":"IFERROR(VLOOKUP(M39,tab!$C$1:$D$5,2,0),0)","v":0},0]
[null,{"$f":"Colab!B40","v":0},{"$f":"Colab!C40","v":0},null,null,null,null,null,null,null,null,null,null,null,"",null,null,0,null,null,null,null,null,null,null,null,null,null,{"$f":"IFERROR(VLOOKUP(E40,tab!$C$1:$D$5,2,0),0)","v":0},{"$f":"IFERROR(VLOOKUP(G40,tab!$C$1:$D$5,2,0),0)","v":0},{"$f":"IFERROR(VLOOKUP(I40,tab!$C$1:$D$5,2,0),0)","v":0},{"$f":"IFERROR(VLOOKUP(K40,tab!$C$1:$D$5,2,0),0)","v":0},{"$f":"IFERROR(VLOOKUP(M40,tab!$C$1:$D$5,2,0),0)","v":0},0]
{"$rows_left_out":24}
{"sheet":"Dashboard","index":5,"n_rows":69,"n_cols":24,"rows_kept":69,"cut":false,"hidden":false,"merged":[[58,11,58,12],[57,14,57,15],[58,14,58,15],[53,8,53,13],[49,18,49,23],[9,10,9,18],[9,2,9,8],[57,1,57,2],[57,4,57,5],[57,7,57,8],[57,11,57,12],[49,1,49,2],[49,4,49,9],[49,11,49,16],[53,15,53,21]]}
[]
[]
[]
[]
[]
[]
[]
[]
[]
[null,"Vaga:",{"$f":"Detalhes!C14","v":"Auxiliar Administrativo"},null,null,null,null,null,null,"Setor:",{"$f":"Detalhes!C26","v":"Administrativo"}]
[]
[]
[]
[]
[]
[]
[]
[]
[]
[]
[]
[]
[]
[]
[]
[]
[]
[]
[]
[]
[]
[]
[]
[]
[]
[]
[]
[]
[]
[]
{"$rows_left_out":30}
{"sheet":"Compativo","index":6,"n_rows":23,"n_cols":4,"rows_kept":23,"cut":false,"hidden":false,"merged":[[22,1,23,1],[22,2,23,2],[22,3,23,3],[18,2,19,2],[20,2,21,2],[18,3,19,3],[20,3,21,3],[18,1,19,1],[20,1,21,1],[16,1,17,1],[12,3,13,3],[14,3,15,3],[16,3,17,3],[10,1,11,1],[10,2,11,2],[10,3,11,3],[12,1,13,1],[14,1,15,1],[12,2,13,2],[14,2,15,2],[16,2,17,2]]}
[]
[]
[]
[]
[]
[]
[]
[]
[]
[]
[null,{"$f":"Colab!B13","v":"Candidato"},"Fulano da Silva","João Paulo"]
[]
[null,{"$f":"Colab!E13","v":"Idade"},{"$f":"VLOOKUP($C$11,Colab!$B$13:$K$63,4,0)","v":19},{"$f":"VLOOKUP($D$11,Colab!$B$13:$K$63,4,0)","v":22}]
[]
[null,{"$f":"Colab!H13","v":"Cidade"},{"$f":"VLOOKUP($C$11,Colab!$B$13:$K$63,7,0)","v":"Bauru"},{"$f":"VLOOKUP($D$11,Colab!$B$13:$K$63,7,0)","v":"Jaú"}]
[]
[null,{"$f":"Colab!I13","v":"Escolaridade"},{"$f":"VLOOKUP($C$11,Colab!$B$13:$K$63,8,0)","v":"Ensino Médio"},{"$f":"VLOOKUP($D$11,Colab!$B$13:$K$63,8,0)","v":"Ensino Superior"}]
[]
[null,{"$f":"Colab!J13","v":"Experiências Relevantes"},{"$f":"VLOOKUP($C$11,Colab!$B$13:$K$63,9,0)","v":"Médio prazo "},{"$f":"VLOOKUP($D$11,Colab!$B$13:$K$63,9,0)","v":"conhecedor básico"}]
[]
[null,{"$f":"Colab!K13","v":"Observações"},{"$f":"VLOOKUP($C$11,Colab!$B$13:$K$63,10,0)","v":"xx"},{"$f":"VLOOKUP($C$11,Colab!$B$13:$K$63,10,0)","v":"xx"}]
[]
[null,"Resultados",{"$f":"VLOOKUP(C11,Dashboard!E65:F69,2,0)","v":0.6},{"$f":"VLOOKUP(D11,Dashboard!E65:F69,2,0)","v":0.8666666666666667}]

{"sheet":"Instruções","index":7,"n_rows":0,"n_cols":0,"rows_kept":0,"cut":false,"hidden":false,"merged":[]}

{"sheet":"tab","index":8,"n_rows":5,"n_cols":4,"rows_kept":5,"cut":false,"hidden":false,"merged":[]}
["Ensino Fundamental",null,"Péssimo",1]
["Ensino Médio",null,"Ruim",2]
["Ensino Superior",null,"Regular",3]
["Pós Graduado",null,"Bom",4]
[null,null,"Excelente",5]